Target
Beta-secretase 2
Ligand
BDBM50393892
Substrate
Meas. Tech.
ChEMBL_855858 (CHEMBL2161502)
IC50
3.9±n/a nM
Citation
 Sund, CBelda, OBorkakoti, NLindberg, JDerbyshire, DVrang, LHamelink, EÅhgren, CWoestenenk, EWikström, KEneroth, ALindström, EKalayanov, G Design and synthesis of potent hydroxyethylamine (HEA) BACE-1 inhibitors carrying prime side 4,5,6,7-tetrahydrobenzazole and 4,5,6,7-tetrahydropyridinoazole templates. Bioorg Med Chem Lett 22:6721-7 (2012)  
Target
Name:
Beta-secretase 2
Synonyms:
AEPLC ASP1 Asp 1 Aspartyl protease 1 BACE2_HUMAN Beta-secretase (BACE) Beta-secretase 2 (BACE-2) Beta-site APP-cleaving enzyme 2 Memapsin-1 beta-Secretase (BACE-2)
Type:
Protein
Mol. Mass.:
56171.20
Organism:
Homo sapiens (Human)
Description:
Q9Y5Z0
Residue:
518
  
Inhibitor
Name:
BDBM50393892
Synonyms:
CHEMBL2158253
Type:
Small organic molecule
Emp. Form.:
C26H38N2O3S
Mol. Mass.:
458.657
SMILES:
CC(=O)N[C@@H](Cc1ccccc1)[C@H](O)CNC1CC(C)(C)Oc2sc(CC(C)(C)C)cc12
: