Target
Histamine H1 receptor
Ligand
BDBM50394163
Substrate
Meas. Tech.
ChEMBL_856370 (CHEMBL2160725)
Ki
19.95±n/a nM
Citation
 Bahl, ABarton, PBowers, KCaffrey, MVDenton, RGilmour, PHawley, SLinannen, TLuckhurst, CAMochel, TPerry, MWRiley, RJRoe, ESpringthorpe, BStein, LWebborn, P Scaffold-hopping with zwitterionic CCR3 antagonists: identification and optimisation of a series with good potency and pharmacokinetics leading to the discovery of AZ12436092. Bioorg Med Chem Lett 22:6694-9 (2012)  
Target
Name:
Histamine H1 receptor
Synonyms:
H1R HISTAMINE H1 HRH1_HUMAN
Type:
G Protein-Coupled Receptor (GPCR)
Mol. Mass.:
55808.72
Organism:
Homo sapiens (Human)
Description:
Cell pellets from SK-N-MC cells transfected with human H1 receptor were used in binding assay.
Residue:
487
  
Inhibitor
Name:
BDBM50394163
Synonyms:
CHEMBL2158817
Type:
Small organic molecule
Emp. Form.:
C24H28Cl2N2O4
Mol. Mass.:
479.396
SMILES:
OC(=O)C(N1CCO[C@@H](CN2CCC(CC2)Oc2ccc(Cl)c(Cl)c2)C1)c1ccccc1
: