Target
Transmembrane protease serine 6
Ligand
BDBM50394322
Substrate
Meas. Tech.
ChEMBL_856936 (CHEMBL2160579)
Ki
88000±n/a nM
Citation
 Dosa, SStirnberg, MLülsdorff, VHäußler, DMaurer, EGütschow, M Active site mapping of trypsin, thrombin and matriptase-2 by sulfamoyl benzamidines. Bioorg Med Chem 20:6489-505 (2012)  
Target
Name:
Transmembrane protease serine 6
Synonyms:
Matriptase-2 TMPS6_HUMAN
Type:
PROTEIN
Mol. Mass.:
90001.12
Organism:
Homo sapiens (Human)
Description:
ChEMBL_1442547
Residue:
811
  
Inhibitor
Name:
BDBM50394322
Synonyms:
CHEMBL2159365
Type:
Small organic molecule
Emp. Form.:
C13H13N3O2S
Mol. Mass.:
275.326
SMILES:
NC(=N)c1ccc(cc1)S(=O)(=O)Nc1ccccc1
: