Target
Prothrombin
Ligand
BDBM50394322
Substrate
Meas. Tech.
ChEMBL_856937 (CHEMBL2160580)
IC50
>500000±n/a nM
Citation
 Dosa, SStirnberg, MLülsdorff, VHäußler, DMaurer, EGütschow, M Active site mapping of trypsin, thrombin and matriptase-2 by sulfamoyl benzamidines. Bioorg Med Chem 20:6489-505 (2012)  
Target
Name:
Prothrombin
Synonyms:
Activation peptide fragment 1 Coagulation factor II Prothrombin precursor Thrombin heavy chain | Thrombin light chain
Type:
Protein
Mol. Mass.:
70029.57
Organism:
Homo sapiens (Human)
Description:
P00734
Residue:
622
  
Inhibitor
Name:
BDBM50394322
Synonyms:
CHEMBL2159365
Type:
Small organic molecule
Emp. Form.:
C13H13N3O2S
Mol. Mass.:
275.326
SMILES:
NC(=N)c1ccc(cc1)S(=O)(=O)Nc1ccccc1
: