Target
Beta-secretase 1
Ligand
BDBM50394449
Substrate
Meas. Tech.
ChEMBL_854822 (CHEMBL2162067)
IC50
>100000±n/a nM
Citation
 Peng, DYSun, QZhu, XLLin, HYChen, QYu, NXYang, WCYang, GF Design, synthesis, and bioevaluation of benzamides: novel acetylcholinesterase inhibitors with multi-functions on butylcholinesterase, Aß aggregation, andß-secretase. Bioorg Med Chem 20:6739-50 (2012)  
Target
Name:
Beta-secretase 1
Synonyms:
ASP2 Aspartyl protease 2 BACE1 Beta-secretase (BACE) Beta-secretase 1 (BACE 1) Beta-secretase 1 (BACE1) Beta-site amyloid precursor protein cleaving enzyme 1 Memapsin-2 beta-Secretase (BACE-1) | beta-Secretase (BACE1)
Type:
Protein
Mol. Mass.:
55755.10
Organism:
Homo sapiens (Human)
Description:
P56817
Residue:
501
  
Inhibitor
Name:
BDBM50394449
Synonyms:
CHEMBL2159660
Type:
Small organic molecule
Emp. Form.:
C29H29N2O3
Mol. Mass.:
453.5516
SMILES:
CC(=O)c1ccccc1NC(=O)c1ccc(OCCCCC[n+]2ccc3ccccc3c2)cc1
: