Target
Cholinesterase
Ligand
BDBM50394446
Substrate
Meas. Tech.
ChEMBL_854818 (CHEMBL2162063)
Ki
93±n/a nM
Citation
 Peng, DYSun, QZhu, XLLin, HYChen, QYu, NXYang, WCYang, GF Design, synthesis, and bioevaluation of benzamides: novel acetylcholinesterase inhibitors with multi-functions on butylcholinesterase, Aß aggregation, andß-secretase. Bioorg Med Chem 20:6739-50 (2012)  
Target
Name:
Cholinesterase
Synonyms:
Acylcholine acylhydrolase Butyrylcholine esterase (BChE) Butyrylcholinesterase (BuChE) CHLE_HUMAN Cholinesterases Pseudocholinesterase
Type:
Homotetramer
Mol. Mass.:
68422.27
Organism:
Homo sapiens (Human)
Description:
P06276
Residue:
602
  
Inhibitor
Name:
BDBM50394446
Synonyms:
CHEMBL2159663
Type:
Small organic molecule
Emp. Form.:
C25H27N2O3
Mol. Mass.:
403.4929
SMILES:
CC(=O)c1ccccc1NC(=O)c1ccc(OCCCCC[n+]2ccccc2)cc1
: