Target
Acetylcholinesterase
Ligand
BDBM50394451
Substrate
Meas. Tech.
ChEMBL_854817 (CHEMBL2162062)
Ki
53±n/a nM
Citation
 Peng, DYSun, QZhu, XLLin, HYChen, QYu, NXYang, WCYang, GF Design, synthesis, and bioevaluation of benzamides: novel acetylcholinesterase inhibitors with multi-functions on butylcholinesterase, Aß aggregation, andß-secretase. Bioorg Med Chem 20:6739-50 (2012)  
Target
Name:
Acetylcholinesterase
Synonyms:
ACES_HUMAN Acetylcholinesterase (AChE) | Acetylcholinesterase (human AChE)
Type:
Enzyme
Mol. Mass.:
67792.70
Organism:
Homo sapiens (Human)
Description:
P22303
Residue:
614
  
Inhibitor
Name:
BDBM50394451
Synonyms:
CHEMBL2159658
Type:
Small organic molecule
Emp. Form.:
C28H27N2O3
Mol. Mass.:
439.525
SMILES:
CC(=O)c1ccccc1NC(=O)c1ccc(OCCCC[n+]2cccc3ccccc23)cc1
: