Target
Acetylcholinesterase
Ligand
BDBM50394453
Substrate
Meas. Tech.
ChEMBL_854817 (CHEMBL2162062)
Ki
198±n/a nM
Citation
 Peng, DYSun, QZhu, XLLin, HYChen, QYu, NXYang, WCYang, GF Design, synthesis, and bioevaluation of benzamides: novel acetylcholinesterase inhibitors with multi-functions on butylcholinesterase, Aß aggregation, andß-secretase. Bioorg Med Chem 20:6739-50 (2012)  
Target
Name:
Acetylcholinesterase
Synonyms:
ACES_HUMAN Acetylcholinesterase (AChE) | Acetylcholinesterase (human AChE)
Type:
Enzyme
Mol. Mass.:
67792.70
Organism:
Homo sapiens (Human)
Description:
P22303
Residue:
614
  
Inhibitor
Name:
BDBM50394453
Synonyms:
CHEMBL2159656
Type:
Small organic molecule
Emp. Form.:
C28H33N4O2
Mol. Mass.:
457.5867
SMILES:
C[N+](C)=c1ccn(CCCCOc2ccc(cc2)C(=O)NCCc2c[nH]c3ccccc23)cc1
: