Target
Acetylcholinesterase
Ligand
BDBM50394454
Substrate
Meas. Tech.
ChEMBL_854817 (CHEMBL2162062)
Ki
>10000±n/a nM
Citation
 Peng, DYSun, QZhu, XLLin, HYChen, QYu, NXYang, WCYang, GF Design, synthesis, and bioevaluation of benzamides: novel acetylcholinesterase inhibitors with multi-functions on butylcholinesterase, Aß aggregation, andß-secretase. Bioorg Med Chem 20:6739-50 (2012)  
Target
Name:
Acetylcholinesterase
Synonyms:
ACES_HUMAN Acetylcholinesterase (AChE) | Acetylcholinesterase (human AChE)
Type:
Enzyme
Mol. Mass.:
67792.70
Organism:
Homo sapiens (Human)
Description:
P22303
Residue:
614
  
Inhibitor
Name:
BDBM50394454
Synonyms:
CHEMBL2159655
Type:
Small organic molecule
Emp. Form.:
C34H30N2O4
Mol. Mass.:
530.613
SMILES:
O=C(NCCc1c[nH]c2ccccc12)c1ccc(OCCCCOc2ccc3-c4ccccc4C(=O)c3c2)cc1
: