Target
Bombesin receptor subtype-3
Ligand
BDBM50394611
Substrate
Meas. Tech.
ChEMBL_857727 (CHEMBL2168754)
EC50
52±n/a nM
Citation
 Chobanian, HRGuo, YLiu, PChioda, MLanza, TJChang, LKelly, TMKan, YPalyha, OGuan, XMMarsh, DJMetzger, JMGorski, JNRaustad, KWang, SPStrack, AMMiller, RPang, JMadeira, MLyons, KDragovic, JReitman, MLNargund, RPLin, LS Discovery of MK-7725, A Potent, Selective Bombesin Receptor Subtype-3 Agonist for the Treatment of Obesity. ACS Med Chem Lett 3:252-256 (2012)  
Target
Name:
Bombesin receptor subtype-3
Synonyms:
BRS-3 BRS3_HUMAN Bombesin like receptor 3
Type:
Enzyme Catalytic Domain
Mol. Mass.:
44424.45
Organism:
Homo sapiens (Human)
Description:
Bombesin 3 BRS3 HUMAN::P32247
Residue:
399
  
Inhibitor
Name:
BDBM50394611
Synonyms:
CHEMBL2164582
Type:
Small organic molecule
Emp. Form.:
C27H26F3N5O4S
Mol. Mass.:
573.587
SMILES:
C[C@H](O)c1nc(no1)-c1cccc2Nc3nc(ccc3CN(c12)S(=O)(=O)c1ccc(cc1)C(C)(C)C)C(F)(F)F
: