Target
Nuclear receptor subfamily 1 group I member 2
Ligand
BDBM50394611
Substrate
Meas. Tech.
ChEMBL_857730 (CHEMBL2168757)
EC50
>10000±n/a nM
Citation
 Chobanian, HRGuo, YLiu, PChioda, MLanza, TJChang, LKelly, TMKan, YPalyha, OGuan, XMMarsh, DJMetzger, JMGorski, JNRaustad, KWang, SPStrack, AMMiller, RPang, JMadeira, MLyons, KDragovic, JReitman, MLNargund, RPLin, LS Discovery of MK-7725, A Potent, Selective Bombesin Receptor Subtype-3 Agonist for the Treatment of Obesity. ACS Med Chem Lett 3:252-256 (2012)  
Target
Name:
Nuclear receptor subfamily 1 group I member 2
Synonyms:
NR1I2 Orphan nuclear receptor PAR1 PXR SXR nuclear receptor subfamily 1 group I member 2 isoform 1
Type:
Nuclear receptor
Mol. Mass.:
49774.77
Organism:
Homo sapiens (Human)
Description:
O75469
Residue:
434
  
Inhibitor
Name:
BDBM50394611
Synonyms:
CHEMBL2164582
Type:
Small organic molecule
Emp. Form.:
C27H26F3N5O4S
Mol. Mass.:
573.587
SMILES:
C[C@H](O)c1nc(no1)-c1cccc2Nc3nc(ccc3CN(c12)S(=O)(=O)c1ccc(cc1)C(C)(C)C)C(F)(F)F
: