Target
Phosphatidylinositol 4,5-bisphosphate 3-kinase catalytic subunit gamma isoform
Ligand
BDBM50394838
Substrate
Meas. Tech.
ChEMBL_860486 (CHEMBL2166655)
Ki
7±n/a nM
Citation
 Smith, ALD'Angelo, NDBo, YYBooker, SKCee, VJHerberich, BHong, FTJackson, CLLanman, BALiu, LNishimura, NPettus, LHReed, ABTadesse, STamayo, NAWurz, RPYang, KAndrews, KLWhittington, DAMcCarter, JDMiguel, TSZalameda, LJiang, JSubramanian, RMullady, ELCaenepeel, SFreeman, DJWang, LZhang, NWu, THughes, PENorman, MH Structure-based design of a novel series of potent, selective inhibitors of the class I phosphatidylinositol 3-kinases. J Med Chem 55:5188-219 (2012)  
Target
Name:
Phosphatidylinositol 4,5-bisphosphate 3-kinase catalytic subunit gamma isoform
Synonyms:
PI3-kinase p110 subunit gamma PI3Kgamma PK3CG_HUMAN Phosphatidylinositol 4,5-bisphosphate 3-kinase (PI3K) Phosphatidylinositol 4,5-bisphosphate 3-kinase catalytic subunit gamma (PI3Kgamma) Phosphatidylinositol 4,5-bisphosphate 3-kinase catalytic subunit gamma isoform (PI3K) Phosphatidylinositol-4,5-bisphosphate 3-kinase catalytic subunit gamma isoform Phosphoinositide 3-kinases gamma (PI3K gamma) p120-PI3K
Type:
Enzyme Subunit
Mol. Mass.:
126470.30
Organism:
Homo sapiens (Human)
Description:
P48736
Residue:
1102
  
Inhibitor
Name:
BDBM50394838
Synonyms:
CHEMBL2165007 | US8772480, 141
Type:
Small organic molecule
Emp. Form.:
C23H23N7O3S
Mol. Mass.:
477.539
SMILES:
COc1ccc(Nc2ncc(Cc3ccc(cc3)S(C)(=O)=O)cc2-c2nc(C)nc(N)n2)cn1
: