Target
Neuropeptide FF receptor 1
Ligand
BDBM86143
Substrate
Meas. Tech.
ChEMBL_858845 (CHEMBL2167891)
EC50
1.7±n/a nM
Citation
 Findeisen, MWürker, CRathmann, DMeier, RMeiler, JOlsson, RBeck-Sickinger, AG Selective mode of action of guanidine-containing non-peptides at human NPFF receptors. J Med Chem 55:6124-36 (2012)  
Target
Name:
Neuropeptide FF receptor 1
Synonyms:
G-protein coupled receptor 147 NPFF1 NPFFR1 | RFamide-related peptide receptor OT7T022
Type:
PROTEIN
Mol. Mass.:
47840.07
Organism:
Homo sapiens (Human)
Description:
ChEMBL_1474637
Residue:
430
  
Inhibitor
Name:
BDBM86143
Synonyms:
L-Val-L-Pro-L-Asn-L-Leu-L-Pro-L-Gln-L-Arg-L-Phe-NH2 RFamide-related peptide 3
Type:
Small organic molecule
Emp. Form.:
C45H72N14O10
Mol. Mass.:
969.141
SMILES:
[#6]-[#6](-[#6])-[#6]-[#6@H](-[#7]-[#6](=O)-[#6@H](-[#6]-[#6](-[#7])=O)-[#7]-[#6](=O)-[#6@@H]-1-[#6]-[#6]-[#6]-[#7]-1-[#6](=O)-[#6@@H](-[#7])-[#6](-[#6])-[#6])-[#6](=O)-[#7]-1-[#6]-[#6]-[#6]-[#6@H]-1-[#6](=O)-[#7]-[#6@@H](-[#6]-[#6]-[#6](-[#7])=O)-[#6](=O)-[#7]-[#6@@H](-[#6]-[#6]-[#6]\[#7]=[#6](\[#7])-[#7])-[#6](=O)-[#7]-[#6@@H](-[#6]-c1ccccc1)-[#6](-[#7])=O
: