Target
5'-nucleotidase
Ligand
BDBM50395084
Substrate
Meas. Tech.
ChEMBL_859457 (CHEMBL2167535)
Ki
1580±n/a nM
Citation
 Ripphausen, PFreundlieb, MBrunschweiger, AZimmermann, HMüller, CEBajorath, J Virtual screening identifies novel sulfonamide inhibitors of ecto-5'-nucleotidase. J Med Chem 55:6576-81 (2012)  
Target
Name:
5'-nucleotidase
Synonyms:
5'-nucleotidase Ecto-5'-nucleotidase (e5'NT) NT Nt5e | Nte
Type:
Enzyme
Mol. Mass.:
63971.44
Organism:
Rattus norvegicus (Rat)
Description:
P21588
Residue:
576
  
Inhibitor
Name:
BDBM50395084
Synonyms:
CHEMBL2164286
Type:
Small organic molecule
Emp. Form.:
C16H11ClN2O5S
Mol. Mass.:
378.787
SMILES:
NS(=O)(=O)c1ccc(NC(=O)c2cc3cc(Cl)ccc3oc2=O)cc1
: