Target
Cannabinoid receptor 1
Ligand
BDBM50395164
Substrate
Meas. Tech.
ChEMBL_859794 (CHEMBL2169622)
Ki
1622±n/a nM
Citation
 Baraldi, PGSaponaro, GMoorman, ARRomagnoli, RPreti, DBaraldi, SRuggiero, EVarani, KTarga, MVincenzi, FBorea, PAAghazadeh Tabrizi, M 7-Oxo-[1,4]oxazino[2,3,4-ij]quinoline-6-carboxamides as selective CB(2) cannabinoid receptor ligands: structural investigations around a novel class of full agonists. J Med Chem 55:6608-23 (2012)  
Target
Name:
Cannabinoid receptor 1
Synonyms:
Brain-type cannabinoid receptor CB-R CNR1_RAT Cannabinoid receptor Cnr1 | Skr6
Type:
G Protein-Coupled Receptor (GPCR)
Mol. Mass.:
52856.55
Organism:
Rattus norvegicus (rat)
Description:
P20272
Residue:
473
  
Inhibitor
Name:
BDBM50395164
Synonyms:
CHEMBL2163933
Type:
Small organic molecule
Emp. Form.:
C17H15N3O3S
Mol. Mass.:
341.384
SMILES:
CCC1COc2cccc3c2n1cc(C(=O)Nc1nccs1)c3=O
: