Target
MAP kinase-activated protein kinase 2
Ligand
BDBM50395274
Substrate
Meas. Tech.
ChEMBL_860407 (CHEMBL2166394)
IC50
7200±n/a nM
Citation
 Kosugi, TMitchell, DRFujino, AImai, MKambe, MKobayashi, SMakino, HMatsueda, YOue, YKomatsu, KImaizumi, KSakai, YSugiura, STakenouchi, OUnoki, GYamakoshi, YCunliffe, VFrearson, JGordon, RHarris, CJKalloo-Hosein, HLe, JPatel, GSimpson, DJSherborne, BThomas, PSSuzuki, NTakimoto-Kamimura, MKataoka, K Mitogen-activated protein kinase-activated protein kinase 2 (MAPKAP-K2) as an antiinflammatory target: discovery and in vivo activity of selective pyrazolo[1,5-a]pyrimidine inhibitors using a focused library and structure-based optimization approach. J Med Chem 55:6700-15 (2012)  
Target
Name:
MAP kinase-activated protein kinase 2
Synonyms:
MAP kinase-activated protein kinase 2 (MAPKAPK2) MAP kinase-activated protein kinase 2 (p38/MK2) MAPK-activated protein kinase 2 MAPKAP kinase 2 MAPKAPK2 | MK2
Type:
Serine/threonine-protein kinase
Mol. Mass.:
45579.87
Organism:
Homo sapiens (Human)
Description:
P49137
Residue:
400
  
Inhibitor
Name:
BDBM50395274
Synonyms:
CHEMBL1235213
Type:
Small organic molecule
Emp. Form.:
C20H26N6O
Mol. Mass.:
366.46
SMILES:
CCOc1ccc(Nc2c(C)c(N[C@H]3CCCNC3)nc3ccnn23)cc1
: