Target
Serine/threonine-protein kinase Chk2
Ligand
BDBM50395274
Substrate
Meas. Tech.
ChEMBL_860369 (CHEMBL2166152)
IC50
>30000±n/a nM
Citation
 Kosugi, TMitchell, DRFujino, AImai, MKambe, MKobayashi, SMakino, HMatsueda, YOue, YKomatsu, KImaizumi, KSakai, YSugiura, STakenouchi, OUnoki, GYamakoshi, YCunliffe, VFrearson, JGordon, RHarris, CJKalloo-Hosein, HLe, JPatel, GSimpson, DJSherborne, BThomas, PSSuzuki, NTakimoto-Kamimura, MKataoka, K Mitogen-activated protein kinase-activated protein kinase 2 (MAPKAP-K2) as an antiinflammatory target: discovery and in vivo activity of selective pyrazolo[1,5-a]pyrimidine inhibitors using a focused library and structure-based optimization approach. J Med Chem 55:6700-15 (2012)  
Target
Name:
Serine/threonine-protein kinase Chk2
Synonyms:
CDS1 CHK2 Checkpoint Kinase (Chk2) Serine/threonine-protein kinase Chek2 | Serine/threonine-protein kinase Chk1/2
Type:
Protein
Mol. Mass.:
60908.59
Organism:
Homo sapiens (Human)
Description:
O96017
Residue:
543
  
Inhibitor
Name:
BDBM50395274
Synonyms:
CHEMBL1235213
Type:
Small organic molecule
Emp. Form.:
C20H26N6O
Mol. Mass.:
366.46
SMILES:
CCOc1ccc(Nc2c(C)c(N[C@H]3CCCNC3)nc3ccnn23)cc1
: