Target
Carbonic anhydrase 1
Ligand
BDBM50395391
Substrate
Meas. Tech.
ChEMBL_857988 (CHEMBL2166496)
Ki
237±n/a nM
Citation
 D'Ambrosio, KSmaine, FZCarta, FDe Simone, GWinum, JYSupuran, CT Development of potent carbonic anhydrase inhibitors incorporating both sulfonamide and sulfamide groups. J Med Chem 55:6776-83 (2012)  
Target
Name:
Carbonic anhydrase 1
Synonyms:
CA-I CAB Carbonate dehydratase I Carbonic anhydrase 1 (CA I) Carbonic anhydrase 1 (Recombinant CA I) Carbonic anhydrase B Carbonic anhydrase I (CA I) Carbonic anhydrase I (CAI) Carbonic anhydrase isoenzyme I (hCA I) | hCA
Type:
Enzyme
Mol. Mass.:
28873.37
Organism:
Homo sapiens (Human)
Description:
P00915
Residue:
261
  
Inhibitor
Name:
BDBM50395391
Synonyms:
CHEMBL2164737
Type:
Small organic molecule
Emp. Form.:
C21H23N5O7S3
Mol. Mass.:
553.632
SMILES:
NS(=O)(=O)Nc1ccc(cc1)S(=O)(=O)Nc1ccc(cc1)C(=O)NCCc1ccc(cc1)S(N)(=O)=O
: