Target
Potassium voltage-gated channel subfamily H member 2
Ligand
BDBM50395399
Substrate
Meas. Tech.
ChEMBL_858025 (CHEMBL2166761)
IC50
35000±n/a nM
Citation
 Reck, FAlm, RABrassil, PNewman, JVCiaccio, PMcNulty, JBarthlow, HGoteti, KBreen, JComita-Prevoir, JCronin, MEhmann, DEGeng, BGodfrey, AAFisher, SL Novel N-linked aminopiperidine inhibitors of bacterial topoisomerase type II with reduced pK(a): antibacterial agents with an improved safety profile. J Med Chem 55:6916-33 (2012)  
Target
Name:
Potassium voltage-gated channel subfamily H member 2
Synonyms:
1,3-beta-glucan synthase component GLS2 ERG Eag-related protein 1 Ether-a-go-go-related gene (HERG) Ether-a-go-go-related gene potassium channel 1 Ether-a-go-go-related gene potassium channel 1 (hERG1) Ether-a-go-go-related protein 1 H-ERG KCNH2 Potassium voltage-gated channel subfamily H member 2 (hERG) Voltage-gated potassium channel subunit Kv11.1 hERG Potassium Channel 1 | putative potassium channel subunit
Type:
Multi-pass membrane protein
Mol. Mass.:
126672.65
Organism:
Homo sapiens (Human)
Description:
Q12809
Residue:
1159
  
Inhibitor
Name:
BDBM50395399
Synonyms:
CHEMBL2165063
Type:
Small organic molecule
Emp. Form.:
C24H28N6O4
Mol. Mass.:
464.5169
SMILES:
COc1ccc2ncc(=O)n(CCN3CCC(CC3)NCc3ccc4OCC(=O)Nc4n3)c2c1
: