Target
Fatty-acid amide hydrolase 1
Ligand
BDBM50395441
Substrate
Meas. Tech.
ChEMBL_858269 (CHEMBL2168075)
Ki
11±n/a nM
Citation
 Butini, SBrindisi, MGemma, SMinetti, PCabri, WGallo, GVincenti, STalamonti, EBorsini, FCaprioli, AStasi, MADi Serio, SRos, SBorrelli, GMaramai, SFezza, FCampiani, GMaccarrone, M Discovery of potent inhibitors of human and mouse fatty acid amide hydrolases. J Med Chem 55:6898-915 (2012)  
Target
Name:
Fatty-acid amide hydrolase 1
Synonyms:
Anandamide amidohydrolase FAAH1_MOUSE Faah1 Fatty-acid amide hydrolase (FAAH) Oleamide hydrolase 1
Type:
Hydrolase; single-pass membrane protein; homodimer
Mol. Mass.:
63227.28
Organism:
Mus musculus (mouse)
Description:
Mouse brain membranes were used in the assay.
Residue:
579
  
Inhibitor
Name:
BDBM50395441
Synonyms:
CHEMBL2165081
Type:
Small organic molecule
Emp. Form.:
C22H20F3N3O5
Mol. Mass.:
463.4065
SMILES:
NC(=O)c1ccn(c1)-c1cccc(OC(=O)NCCOCCOc2c(F)cc(F)cc2F)c1
: