Target
Vascular endothelial growth factor receptor 2
Ligand
BDBM50180753
Substrate
Meas. Tech.
ChEMBL_858285 (CHEMBL2168091)
IC50
8800±n/a nM
Citation
 Dakshanamurthy, SIssa, NTAssefnia, SSeshasayee, APeters, OJMadhavan, SUren, ABrown, MLByers, SW Predicting new indications for approved drugs using a proteochemometric method. J Med Chem 55:6832-48 (2012)  
Target
Name:
Vascular endothelial growth factor receptor 2
Synonyms:
CD_antigen=CD309 Fetal liver kinase 1 (FLK-1) KDR Protein-tyrosine kinase receptor Flk-1 VEGFR-2 VEGFR2 Vascular Endothelial Growth Factor Receptor Kinase 2 Vascular endothelial growth factor receptor 2 (KDR) Vascular endothelial growth factor receptor 2 (VEGFR2) Vascular endothelial growth factor receptor-2 (VEGFR-2)
Type:
Receptor Tyrosine Kinase
Mol. Mass.:
151510.97
Organism:
Homo sapiens (Human)
Description:
P35968
Residue:
1356
  
Inhibitor
Name:
BDBM50180753
Synonyms:
(5-benzoyl-1H-benzimidazol-2-yl)-carbamic acid methyl ester MBDZ Vermox | methyl (5-benzoyl-1H-benzimidazol-2-yl)carbamate
Type:
Small organic molecule
Emp. Form.:
C16H13N3O3
Mol. Mass.:
295.2927
SMILES:
COC(=O)Nc1nc2ccc(cc2[nH]1)C(=O)c1ccccc1
: