Target
D(2) dopamine receptor
Ligand
BDBM50395578
Substrate
Meas. Tech.
ChEMBL_859682 (CHEMBL2169117)
Ki
42±n/a nM
Citation
 Chen, XSassano, MFZheng, LSetola, VChen, MBai, XFrye, SVWetsel, WCRoth, BLJin, J Structure-functional selectivity relationship studies ofß-arrestin-biased dopamine D2 receptor agonists. J Med Chem 55:7141-53 (2012)  
Target
Name:
D(2) dopamine receptor
Synonyms:
D(2) dopamine receptor DOPAMINE D2 Long DRD2 Dopamine D2 receptor Dopamine D2 receptor (D2R) Dopamine2-like | d2
Type:
Cell-surface receptors
Mol. Mass.:
50647.10
Organism:
Homo sapiens (Human)
Description:
P14416
Residue:
443
  
Inhibitor
Name:
BDBM50395578
Synonyms:
CHEMBL2165137 US9156822, 21
Type:
Small organic molecule
Emp. Form.:
C22H24Cl2N2OS
Mol. Mass.:
435.41
SMILES:
Clc1cccc(C2CCN(CCCCOc3ccc4scnc4c3)CC2)c1Cl
: