Target
Endothelin-1 receptor
Ligand
BDBM50395627
Substrate
Meas. Tech.
ChEMBL_859881 (CHEMBL2166382)
IC50
0.8±n/a nM
Citation
 Bolli, MHBoss, CBinkert, CBuchmann, SBur, DHess, PIglarz, MMeyer, SRein, JRey, MTreiber, AClozel, MFischli, WWeller, T The discovery of N-[5-(4-bromophenyl)-6-[2-[(5-bromo-2-pyrimidinyl)oxy]ethoxy]-4-pyrimidinyl]-N'-propylsulfamide (Macitentan), an orally active, potent dual endothelin receptor antagonist. J Med Chem 55:7849-61 (2012)  
Target
Name:
Endothelin-1 receptor
Synonyms:
EDNRA ET-A ETA-R Endothelin receptor type A hET-AR
Type:
Enzyme Catalytic Domain
Mol. Mass.:
48736.88
Organism:
Homo sapiens (Human)
Description:
P25101
Residue:
427
  
Inhibitor
Name:
BDBM50395627
Synonyms:
CHEMBL2165338
Type:
Small organic molecule
Emp. Form.:
C18H18Br2N6O4S
Mol. Mass.:
574.246
SMILES:
CCNS(=O)(=O)Nc1ncnc(OCCOc2ncc(Br)cn2)c1-c1ccc(Br)cc1
: