Target
Muscarinic acetylcholine receptor M1
Ligand
BDBM50395967
Substrate
Meas. Tech.
ChEMBL_858567 (CHEMBL2166012)
IC50
2398.83±n/a nM
Citation
 Poslusney, MSSevel, CUtley, TJBridges, TMMorrison, RDKett, NRSheffler, DJNiswender, CMDaniels, JSConn, PJLindsley, CWWood, MR Synthesis and biological characterization of a series of novel diaryl amide M1 antagonists. Bioorg Med Chem Lett 22:6923-8 (2012)  
Target
Name:
Muscarinic acetylcholine receptor M1
Synonyms:
ACM1_HUMAN Cholinergic receptor, muscarinic 1 | Cholinergic, muscarinic M1
Type:
Protein
Mol. Mass.:
51442.54
Organism:
Homo sapiens (Human)
Description:
P11229
Residue:
460
  
Inhibitor
Name:
BDBM50395967
Synonyms:
CHEMBL2164904
Type:
Small organic molecule
Emp. Form.:
C20H23FN2O
Mol. Mass.:
326.4078
SMILES:
CN1CCN(CC1)C(=O)[C@](F)(Cc1ccccc1)c1ccccc1
: