Target
5-hydroxytryptamine receptor 2C
Ligand
BDBM50396033
Substrate
Meas. Tech.
ChEMBL_861531 (CHEMBL2174379)
IC50
10±n/a nM
Citation
 Calderón, FVidal-Mas, JBurrows, Jde la Rosa, JCJiménez-Díaz, MBMulet, TPrats, SSolana, JWitty, MGamo, FJFernández, E A Divergent SAR Study Allows Optimization of a Potent 5-HT2c Inhibitor to a Promising Antimalarial Scaffold. ACS Med Chem Lett 3:373-377 (2012)  
Target
Name:
5-hydroxytryptamine receptor 2C
Synonyms:
5-HT-1C 5-HT1C 5-HT2C-INI 5-HTR2C 5-hydroxytryptamine receptor 2C (5-HT-2C) 5HT-1C HTR1C Serotonin (5-HT3) receptor Serotonin Receptor 2C
Type:
G Protein-Coupled Receptor (GPCR)
Mol. Mass.:
51836.79
Organism:
Homo sapiens (Human)
Description:
P28335
Residue:
458
  
Inhibitor
Name:
BDBM50396033
Synonyms:
CHEMBL2169982
Type:
Small organic molecule
Emp. Form.:
C23H17F6N3O2
Mol. Mass.:
481.3904
SMILES:
COc1cc2CCN(C(=O)Nc3cc(cc(c3)C(F)(F)F)-c3cccnc3)c2cc1C(F)(F)F
: