Target
NAD-dependent protein deacetylase sirtuin-1
Ligand
BDBM50396049
Substrate
Meas. Tech.
ChEMBL_861572 (CHEMBL2174513)
EC50
900±n/a nM
Citation
 Blum, CAEllis, JLLoh, CNg, PYPerni, RBStein, RL SIRT1 modulation as a novel approach to the treatment of diseases of aging. J Med Chem 54:417-32 (2011)  
Target
Name:
NAD-dependent protein deacetylase sirtuin-1
Synonyms:
NAD-Dependent Deacetylase Sirtuin-1 NAD-dependent protein deacetylase sirtuin-1 (SIRT1) SIR2-like protein 1 SIRT1 Sirtuin-1 (SIRT1) | hSIR2
Type:
Developmental protein; hydrolase
Mol. Mass.:
81626.66
Organism:
Homo sapiens (Human)
Description:
Residue:
747
  
Inhibitor
Name:
BDBM50396049
Synonyms:
CHEMBL473881
Type:
Small organic molecule
Emp. Form.:
C21H17N3O4
Mol. Mass.:
375.3774
SMILES:
COc1ccc(cc1OC)C(=O)Nc1ccccc1-c1nc2ncccc2o1
: