Target
Tyrosine-protein kinase JAK2
Ligand
BDBM482160
Substrate
Meas. Tech.
ChEMBL_862780 (CHEMBL2174492)
Ki
>3200±n/a nM
Citation
 Chen, HChan, BKDrummond, JEstrada, AAGunzner-Toste, JLiu, XLiu, YMoffat, JShore, DSweeney, ZKTran, TWang, SZhao, GZhu, HBurdick, DJ Discovery of selective LRRK2 inhibitors guided by computational analysis and molecular modeling. J Med Chem 55:5536-45 (2012)  
Target
Name:
Tyrosine-protein kinase JAK2
Synonyms:
JAK-2 JAK2_HUMAN Janus kinase 2 (JAK2) | Janus kinase 2 (a protein tyrosine kinase)
Type:
Protein
Mol. Mass.:
130684.68
Organism:
Homo sapiens (Human)
Description:
O60674
Residue:
1132
  
Inhibitor
Name:
BDBM482160
Synonyms:
BDBM50396041 | HG-10-102-01
Type:
Emp. Form.:
C17H20ClN5O3
Mol. Mass.:
377.825
SMILES:
CNc1nc(Nc2ccc(cc2OC)C(=O)N2CCOCC2)ncc1Cl
: