Target
Tyrosine-protein kinase JAK2
Ligand
BDBM50396157
Substrate
Meas. Tech.
ChEMBL_862780 (CHEMBL2174492)
Ki
64±n/a nM
Citation
 Chen, HChan, BKDrummond, JEstrada, AAGunzner-Toste, JLiu, XLiu, YMoffat, JShore, DSweeney, ZKTran, TWang, SZhao, GZhu, HBurdick, DJ Discovery of selective LRRK2 inhibitors guided by computational analysis and molecular modeling. J Med Chem 55:5536-45 (2012)  
Target
Name:
Tyrosine-protein kinase JAK2
Synonyms:
JAK-2 JAK2_HUMAN Janus kinase 2 (JAK2) | Janus kinase 2 (a protein tyrosine kinase)
Type:
Protein
Mol. Mass.:
130684.68
Organism:
Homo sapiens (Human)
Description:
O60674
Residue:
1132
  
Inhibitor
Name:
BDBM50396157
Synonyms:
CHEMBL2171736
Type:
Small organic molecule
Emp. Form.:
C11H11ClN4
Mol. Mass.:
234.685
SMILES:
CNc1nc(Nc2ccccc2)ncc1Cl
: