Target
Tyrosine-protein kinase JAK2
Ligand
BDBM50396159
Substrate
Meas. Tech.
ChEMBL_862780 (CHEMBL2174492)
Ki
3±n/a nM
Citation
 Chen, HChan, BKDrummond, JEstrada, AAGunzner-Toste, JLiu, XLiu, YMoffat, JShore, DSweeney, ZKTran, TWang, SZhao, GZhu, HBurdick, DJ Discovery of selective LRRK2 inhibitors guided by computational analysis and molecular modeling. J Med Chem 55:5536-45 (2012)  
Target
Name:
Tyrosine-protein kinase JAK2
Synonyms:
JAK-2 JAK2_HUMAN Janus kinase 2 (JAK2) | Janus kinase 2 (a protein tyrosine kinase)
Type:
Protein
Mol. Mass.:
130684.68
Organism:
Homo sapiens (Human)
Description:
O60674
Residue:
1132
  
Inhibitor
Name:
BDBM50396159
Synonyms:
CHEMBL2171747
Type:
Small organic molecule
Emp. Form.:
C21H20N4
Mol. Mass.:
328.4103
SMILES:
Cc1cc(cc(C)c1C)-c1ccc2nc(Nc3ccccc3)nn2c1
: