Target
Signal transducer and activator of transcription 3
Ligand
BDBM50353441
Substrate
Meas. Tech.
ChEMBL_863006 (CHEMBL2175186)
Ki
15000±n/a nM
Citation
 Debnath, BXu, SNeamati, N Small molecule inhibitors of signal transducer and activator of transcription 3 (Stat3) protein. J Med Chem 55:6645-68 (2012)  
Target
Name:
Signal transducer and activator of transcription 3
Synonyms:
APRF STAT3_HUMAN Signal transducer and activator of transcription 3 (STAT3)
Type:
Protein
Mol. Mass.:
88064.31
Organism:
Homo sapiens (Human)
Description:
P40763
Residue:
770
  
Inhibitor
Name:
BDBM50353441
Synonyms:
CHEMBL1829786
Type:
Small organic molecule
Emp. Form.:
C30H34N2O6S
Mol. Mass.:
550.666
SMILES:
CN(CC(=O)N(Cc1ccc(cc1)C1CCCCC1)c1ccc(C(O)=O)c(O)c1)S(=O)(=O)c1ccc(C)cc1
: