Target
Neprilysin
Ligand
BDBM50396562
Substrate
Meas. Tech.
ChEMBL_863254 (CHEMBL2176197)
IC50
>1000±n/a nM
Citation
 Ruf, SBuning, CSchreuder, HHorstick, GLinz, WOlpp, TPernerstorfer, JHiss, KKroll, KKannt, AKohlmann, MLinz, DHübschle, TRütten, HWirth, KSchmidt, TSadowski, T Novelß-amino acid derivatives as inhibitors of cathepsin A. J Med Chem 55:7636-49 (2012)  
Target
Name:
Neprilysin
Synonyms:
Atriopeptidase CD_antigen=CD10 EPN MME NEP_HUMAN Neutral endopeptidase | Neutral endopeptidase 24.11
Type:
Enzyme
Mol. Mass.:
85505.38
Organism:
Homo sapiens (Human)
Description:
P08473
Residue:
750
  
Inhibitor
Name:
BDBM50396562
Synonyms:
CHEMBL2171392
Type:
Small organic molecule
Emp. Form.:
C26H30FN3O5
Mol. Mass.:
483.5319
SMILES:
Cc1ccccc1[C@H](CC(O)=O)NC(=O)c1cc(OC[C@H](O)C(C)(C)C)n(n1)-c1ccccc1F
: