Target
Vasopressin V2 receptor
Ligand
BDBM50397217
Substrate
Meas. Tech.
ChEMBL_864210 (CHEMBL2175262)
Ki
54.3±n/a nM
Citation
 Loison, SCottet, MOrcel, HAdihou, HRahmeh, RLamarque, LTrinquet, EKellenberger, EHibert, MDurroux, TMouillac, BBonnet, D Selective fluorescent nonpeptidic antagonists for vasopressin V2 GPCR: application to ligand screening and oligomerization assays. J Med Chem 55:8588-602 (2012)  
Target
Name:
Vasopressin V2 receptor
Synonyms:
ADHR AVPR2 DIR Renal-type arginine vasopressin receptor V2R_HUMAN Vasopressin V2 receptor | Vasopressin receptor
Type:
Receptor
Mol. Mass.:
40295.28
Organism:
Homo sapiens (Human)
Description:
P30518
Residue:
371
  
Inhibitor
Name:
BDBM50397217
Synonyms:
CHEMBL2172293
Type:
Small organic molecule
Emp. Form.:
C67H78N10O13S2
Mol. Mass.:
1295.525
SMILES:
CCN(CC)c1ccc2c(-c3ccc(cc3S([O-])(=O)=O)S(=O)(=O)NCCOCCOCCOCCn3cc(CNC(=O)CCC(=O)NC4CCCN(C(=O)c5ccc(NC(=O)c6ccccc6C)cc5)c5ccccc45)nn3)c3ccc(cc3oc2c1)=[N+](CC)CC
: