Target
Vasopressin V1a receptor
Ligand
BDBM50307117
Substrate
Meas. Tech.
ChEMBL_864209 (CHEMBL2175261)
Ki
14.1±n/a nM
Citation
 Loison, SCottet, MOrcel, HAdihou, HRahmeh, RLamarque, LTrinquet, EKellenberger, EHibert, MDurroux, TMouillac, BBonnet, D Selective fluorescent nonpeptidic antagonists for vasopressin V2 GPCR: application to ligand screening and oligomerization assays. J Med Chem 55:8588-602 (2012)  
Target
Name:
Vasopressin V1a receptor
Synonyms:
AVPR V1a AVPR1A V1AR_HUMAN VASOPRESSIN V1A Vasopressin V1 receptor Vasopressin receptor
Type:
Receptor
Mol. Mass.:
46820.18
Organism:
Homo sapiens (Human)
Description:
P37288
Residue:
418
  
Inhibitor
Name:
BDBM50307117
Synonyms:
CHEMBL603708 | N-(4-(2,3,4,5-tetrahydro-1H-benzo[b]azepine-1-carbonyl)phenyl)biphenyl-2-carboxamide
Type:
Small organic molecule
Emp. Form.:
C30H26N2O2
Mol. Mass.:
446.5396
SMILES:
O=C(Nc1ccc(cc1)C(=O)N1CCCCc2ccccc12)c1ccccc1-c1ccccc1
: