Target
Vasopressin V1a receptor
Ligand
BDBM35714
Substrate
Meas. Tech.
ChEMBL_864209 (CHEMBL2175261)
Ki
195±n/a nM
Citation
 Loison, SCottet, MOrcel, HAdihou, HRahmeh, RLamarque, LTrinquet, EKellenberger, EHibert, MDurroux, TMouillac, BBonnet, D Selective fluorescent nonpeptidic antagonists for vasopressin V2 GPCR: application to ligand screening and oligomerization assays. J Med Chem 55:8588-602 (2012)  
Target
Name:
Vasopressin V1a receptor
Synonyms:
AVPR V1a AVPR1A V1AR_HUMAN VASOPRESSIN V1A Vasopressin V1 receptor Vasopressin receptor
Type:
Receptor
Mol. Mass.:
46820.18
Organism:
Homo sapiens (Human)
Description:
P37288
Residue:
418
  
Inhibitor
Name:
BDBM35714
Synonyms:
CHEMBL420762 N-[4-(5-Dimethylamino-2,3,4,5-tetrahydro-benzo[b]azepine-1-carbonyl)-phenyl]-2-methyl-benzamide | OPC-31260
Type:
Small organic molecule
Emp. Form.:
C27H29N3O2
Mol. Mass.:
427.5381
SMILES:
CN(C)C1CCCN(C(=O)c2ccc(NC(=O)c3ccccc3C)cc2)c2ccccc12
: