Target
Oxytocin receptor
Ligand
BDBM50397207
Substrate
Meas. Tech.
ChEMBL_864195 (CHEMBL2175247)
Ki
665±n/a nM
Citation
 Loison, SCottet, MOrcel, HAdihou, HRahmeh, RLamarque, LTrinquet, EKellenberger, EHibert, MDurroux, TMouillac, BBonnet, D Selective fluorescent nonpeptidic antagonists for vasopressin V2 GPCR: application to ligand screening and oligomerization assays. J Med Chem 55:8588-602 (2012)  
Target
Name:
Oxytocin receptor
Synonyms:
OT-R OXYR_HUMAN | Oxytocin
Type:
Enzyme Catalytic Domain
Mol. Mass.:
42793.26
Organism:
Homo sapiens (Human)
Description:
Oxytocin OXTR HEK293::B2R9L7
Residue:
389
  
Inhibitor
Name:
BDBM50397207
Synonyms:
CHEMBL2172288
Type:
Small organic molecule
Emp. Form.:
C66H63N9O12S
Mol. Mass.:
1206.325
SMILES:
OC(=O)c1cc(NC(=S)NCCOCCOCCOCCn2cc(CNC(=O)CCC(=O)NC3CCCN(C(=O)c4ccc(NC(=O)c5ccccc5-c5ccccc5)cc4)c4ccccc34)nn2)ccc1-c1c2ccc(O)cc2oc2cc(=O)ccc12
: