Target
Sterol O-acyltransferase 1
Ligand
BDBM50397449
Substrate
Meas. Tech.
ChEMBL_864990 (CHEMBL2176154)
IC50
1800±n/a nM
Citation
 Pokhrel, LMaezawa, INguyen, TDChang, KOJin, LWHua, DH Inhibition of Acyl-CoA: cholesterol acyltransferase (ACAT), overexpression of cholesterol transporter gene, and protection of amyloidß (Aß) oligomers-induced neuronal cell death by tricyclic pyrone molecules. J Med Chem 55:8969-73 (2012)  
Target
Name:
Sterol O-acyltransferase 1
Synonyms:
ACACT ACAT Acetyl-CoA acetyltransferase, mitochondrial Acyl-CoA: cholesterol acyltransferase (ACAT) Cholesterol acyltransferase 1 SOAT1 STAT
Type:
Multi-pass membrane protein may form homo- or heterodimers.
Mol. Mass.:
64751.94
Organism:
Homo sapiens (Human)
Description:
P35610
Residue:
550
  
Inhibitor
Name:
BDBM50397449
Synonyms:
CHEMBL2170832
Type:
Small organic molecule
Emp. Form.:
C23H26FNO4
Mol. Mass.:
399.4552
SMILES:
CC(CNCc1ccc(O)c(F)c1)[C@H]1CCC2=Cc3c(O[C@H]2C1)cc(C)oc3=O
: