Target
C-C chemokine receptor type 3
Ligand
BDBM50397494
Substrate
Meas. Tech.
ChEMBL_862020 (CHEMBL2173970)
Ki
0.631±n/a nM
Citation
 Bahl, ABarton, PBowers, KBrough, SEvans, RLuckhurst, CAMochel, TPerry, MWRigby, ARiley, RJSanganee, HSisson, ASpringthorpe, B The discovery of CCR3/H1 dual antagonists with reduced hERG risk. Bioorg Med Chem Lett 22:6688-93 (2012)  
Target
Name:
C-C chemokine receptor type 3
Synonyms:
C-C CKR-3 CC-CKR-3 CCR3 CD_antigen=CD193 CMKBR3 | Eosinophil eotaxin receptor
Type:
Enzyme
Mol. Mass.:
41053.88
Organism:
Homo sapiens (Human)
Description:
P51677
Residue:
355
  
Inhibitor
Name:
BDBM50397494
Synonyms:
CHEMBL2171047
Type:
Small organic molecule
Emp. Form.:
C25H31Cl2N3O4S
Mol. Mass.:
540.502
SMILES:
Cc1ccc(cc1)S(=O)(=O)NC(=O)N1CCC(CC1)N1CCC(CC1)Oc1ccc(Cl)c(C)c1Cl
: