Target
Metabotropic glutamate receptor 2
Ligand
BDBM50094843
Substrate
Meas. Tech.
ChEMBL_873325 (CHEMBL2185178)
EC50
0.57±n/a nM
Citation
 Wang, JQZhang, ZKuruppu, DBrownell, AL Radiosynthesis of PET radiotracer as a prodrug for imaging group II metabotropic glutamate receptors in vivo. Bioorg Med Chem Lett 22:1958-62 (2012)  
Target
Name:
Metabotropic glutamate receptor 2
Synonyms:
GPRC1B GRM2_HUMAN Metabotropic glutamate receptor mGlu2 | metabotropic glutamate 2
Type:
Enzyme
Mol. Mass.:
95584.88
Organism:
Homo sapiens (Human)
Description:
Q14416
Residue:
872
  
Inhibitor
Name:
BDBM50094843
Synonyms:
(+)-2-Amino-6-fluoro-4-oxo-bicyclo[3.1.0]hexane-2,6-dicarboxylic acid (-)-2-Amino-6-fluoro-4-oxo-bicyclo[3.1.0]hexane-2,6-dicarboxylic acid CHEMBL121053
Type:
Small organic molecule
Emp. Form.:
C8H8FNO5
Mol. Mass.:
217.1512
SMILES:
N[C@]1(CC(=O)[C@@H]2[C@H]1[C@@]2(F)C(O)=O)C(O)=O
: