Target
Beta-secretase 1
Ligand
BDBM50397678
Substrate
Meas. Tech.
ChEMBL_873885 (CHEMBL2184296)
IC50
17±n/a nM
Citation
 Weiss, MMWilliamson, TBabu-Khan, SBartberger, MDBrown, JChen, KCheng, YCitron, MCroghan, MDDineen, TAEsmay, JGraceffa, RFHarried, SSHickman, DHitchcock, SAHorne, DBHuang, HImbeah-Ampiah, RJudd, TKaller, MRKreiman, CRLa, DSLi, VLopez, PLouie, SMonenschein, HNguyen, TTPennington, LDRattan, CSan Miguel, TSickmier, EAWahl, RCWen, PHWood, SXue, QYang, BHPatel, VFZhong, W Design and preparation of a potent series of hydroxyethylamine containingß-secretase inhibitors that demonstrate robust reduction of centralß-amyloid. J Med Chem 55:9009-24 (2012)  
Target
Name:
Beta-secretase 1
Synonyms:
ASP2 Aspartyl protease 2 BACE1 Beta-secretase (BACE) Beta-secretase 1 (BACE 1) Beta-secretase 1 (BACE1) Beta-site amyloid precursor protein cleaving enzyme 1 Memapsin-2 beta-Secretase (BACE-1) | beta-Secretase (BACE1)
Type:
Protein
Mol. Mass.:
55755.10
Organism:
Homo sapiens (Human)
Description:
P56817
Residue:
501
  
Inhibitor
Name:
BDBM50397678
Synonyms:
CHEMBL2181880
Type:
Small organic molecule
Emp. Form.:
C31H43N3O6
Mol. Mass.:
553.6896
SMILES:
CO[C@H](C)C(=O)N[C@@H](Cc1ccc2OCOc2c1)[C@H](O)CN[C@H]1CC2(CCC2)Oc2ncc(CC(C)(C)C)cc12
: