Target
Adenosine receptor A2a
Ligand
BDBM50163010
Substrate
Meas. Tech.
ChEMBL_874131 (CHEMBL2187072)
Ki
2530±n/a nM
Citation
 Baraldi, PGPreti, DBorea, PAVarani, K Medicinal chemistry of A3 adenosine receptor modulators: pharmacological activities and therapeutic implications. J Med Chem 55:5676-703 (2012)  
Target
Name:
Adenosine receptor A2a
Synonyms:
A2A adenosine receptor (hA2A) ADENOSINE A2 ADORA2 Adenosine A2A receptor (A2AAR)
Type:
G Protein-Coupled Receptor (GPCR)
Mol. Mass.:
44716.46
Organism:
Homo sapiens (Human)
Description:
P29274
Residue:
412
  
Inhibitor
Name:
BDBM50163010
Synonyms:
(2R,3S,4R,5R)-2-Hydroxymethyl-5-[6-(2-phenyl-cyclopropylamino)-purin-9-yl]-tetrahydro-furan-3,4-diol | CHEMBL193421
Type:
Small organic molecule
Emp. Form.:
C19H21N5O4
Mol. Mass.:
383.4011
SMILES:
OC[C@H]1O[C@H]([C@H](O)[C@@H]1O)n1cnc2c(NC3CC3c3ccccc3)ncnc12
: