Target
Adenosine receptor A2a
Ligand
BDBM50397717
Substrate
Meas. Tech.
ChEMBL_874131 (CHEMBL2187072)
Ki
470±n/a nM
Citation
 Baraldi, PGPreti, DBorea, PAVarani, K Medicinal chemistry of A3 adenosine receptor modulators: pharmacological activities and therapeutic implications. J Med Chem 55:5676-703 (2012)  
Target
Name:
Adenosine receptor A2a
Synonyms:
A2A adenosine receptor (hA2A) ADENOSINE A2 ADORA2 Adenosine A2A receptor (A2AAR)
Type:
G Protein-Coupled Receptor (GPCR)
Mol. Mass.:
44716.46
Organism:
Homo sapiens (Human)
Description:
P29274
Residue:
412
  
Inhibitor
Name:
BDBM50397717
Synonyms:
CHEMBL2181965
Type:
Small organic molecule
Emp. Form.:
C16H16BrN5O
Mol. Mass.:
374.235
SMILES:
CCCn1c2nc(nc2c2NCCn2c1=O)-c1ccc(Br)cc1
: