Target
Adenosine receptor A1
Ligand
BDBM50163010
Substrate
Meas. Tech.
ChEMBL_874129 (CHEMBL2187070)
Ki
124±n/a nM
Citation
 Baraldi, PGPreti, DBorea, PAVarani, K Medicinal chemistry of A3 adenosine receptor modulators: pharmacological activities and therapeutic implications. J Med Chem 55:5676-703 (2012)  
Target
Name:
Adenosine receptor A1
Synonyms:
A1 adenosine receptor (hA1) AA1R_HUMAN ADORA1 Adenosine A1-receptor Adenosine receptor A1 (hA1) | Adenosine transporter (AdT)
Type:
G Protein-Coupled Receptor (GPCR)
Mol. Mass.:
36520.92
Organism:
Homo sapiens (Human)
Description:
P30542
Residue:
326
  
Inhibitor
Name:
BDBM50163010
Synonyms:
(2R,3S,4R,5R)-2-Hydroxymethyl-5-[6-(2-phenyl-cyclopropylamino)-purin-9-yl]-tetrahydro-furan-3,4-diol | CHEMBL193421
Type:
Small organic molecule
Emp. Form.:
C19H21N5O4
Mol. Mass.:
383.4011
SMILES:
OC[C@H]1O[C@H]([C@H](O)[C@@H]1O)n1cnc2c(NC3CC3c3ccccc3)ncnc12
: