Target
Cytosol aminopeptidase
Ligand
BDBM50397951
Substrate
Meas. Tech.
ChEMBL_872713 (CHEMBL2185126)
Ki
>100000±n/a nM
Citation
 Albrecht, SSalomon, EDefoin, ATarnus, C Rapid and efficient synthesis of a novel series of substituted aminobenzosuberone derivatives as potent, selective, non-peptidic neutral aminopeptidase inhibitors. Bioorg Med Chem 20:4942-53 (2012)  
Target
Name:
Cytosol aminopeptidase
Synonyms:
AMPL_BOVIN LAP3 Leucine Aminopeptidase | Leucyl aminopeptidase
Type:
Homohexamer
Mol. Mass.:
56288.28
Organism:
Bos taurus (bovine)
Description:
Bovine kidney LAPc was purchased from Sigma Chemical Co.
Residue:
519
  
Inhibitor
Name:
BDBM50397951
Synonyms:
CHEMBL2179981
Type:
Small organic molecule
Emp. Form.:
C19H21NO
Mol. Mass.:
279.3761
SMILES:
N[C@H]1CCc2ccccc2[C@@H](CCc2ccccc2)C1=O
: