Target
cAMP and cAMP-inhibited cGMP 3',5'-cyclic phosphodiesterase 10A
Ligand
BDBM50397999
Substrate
Meas. Tech.
ChEMBL_872920 (CHEMBL2187451)
IC50
0.100000±n/a nM
Citation
 Chappie, TAHelal, CJHou, X Current landscape of phosphodiesterase 10A (PDE10A) inhibition. J Med Chem 55:7299-331 (2012)  
Target
Name:
cAMP and cAMP-inhibited cGMP 3',5'-cyclic phosphodiesterase 10A
Synonyms:
3',5'-cyclic phosphodiesterase PDE10A Phosphodiesterase 10 (PDE10) | Phosphodiesterase 10A
Type:
Protein
Mol. Mass.:
88412.52
Organism:
Homo sapiens (Human)
Description:
Q9Y233
Residue:
1055
  
Inhibitor
Name:
BDBM50397999
Synonyms:
CHEMBL2180796
Type:
Small organic molecule
Emp. Form.:
C23H22N6O3
Mol. Mass.:
430.4592
SMILES:
Cn1ncc(C(=O)N2CCOCC2)c1C(=O)Nc1ccn2cc(nc2c1)-c1ccccc1
: