Target
Lysophosphatidic acid receptor 1
Ligand
BDBM50398109
Substrate
Meas. Tech.
ChEMBL_873925 (CHEMBL2184761)
IC50
>30000±n/a nM
Citation
 Qian, YHamilton, MSidduri, AGabriel, SRen, YPeng, RKondru, RNarayanan, ATruitt, THamid, RChen, YZhang, LFretland, AJSanchez, RAChang, KCLucas, MSchoenfeld, RCLaine, DFuentes, MEStevenson, CSBudd, DC Discovery of highly selective and orally active lysophosphatidic acid receptor-1 antagonists with potent activity on human lung fibroblasts. J Med Chem 55:7920-39 (2012)  
Target
Name:
Lysophosphatidic acid receptor 1
Synonyms:
EDG2 LPA-1 LPAR1 Lysophosphatidic acid receptor 1 (LPA1) | Lysophosphatidic acid receptor Edg-2
Type:
Enzyme
Mol. Mass.:
41120.55
Organism:
Homo sapiens (Human)
Description:
Q92633
Residue:
364
  
Inhibitor
Name:
BDBM50398109
Synonyms:
CHEMBL2182055
Type:
Small organic molecule
Emp. Form.:
C25H23N3O2
Mol. Mass.:
397.469
SMILES:
C[C@@H](OC(=O)Nc1c(cnn1C)-c1ccc(cc1)-c1ccccc1)c1ccccc1
: