Target
Cannabinoid receptor 1
Ligand
BDBM50398226
Substrate
Meas. Tech.
ChEMBL_874193 (CHEMBL2187925)
Ki
19100±n/a nM
Citation
 Rempel, VVolz, NHinz, SKarcz, TMeliciani, INieger, MWenzel, WBräse, SMüller, CE 7-Alkyl-3-benzylcoumarins: a versatile scaffold for the development of potent and selective cannabinoid receptor agonists and antagonists. J Med Chem 55:7967-77 (2012)  
Target
Name:
Cannabinoid receptor 1
Synonyms:
CANN6 CB-R CNR CNR1_HUMAN Cannabinoid receptor Cannabinoid receptor 1 (brain)
Type:
G Protein-Coupled Receptor (GPCR)
Mol. Mass.:
52868.96
Organism:
Homo sapiens (Human)
Description:
P21554
Residue:
472
  
Inhibitor
Name:
BDBM50398226
Synonyms:
CHEMBL2177260
Type:
Small organic molecule
Emp. Form.:
C21H21ClO3
Mol. Mass.:
356.843
SMILES:
CCCCCc1cc(O)c2cc(Cc3ccccc3Cl)c(=O)oc2c1
: