Target
Cannabinoid receptor 2
Ligand
BDBM50398226
Substrate
Meas. Tech.
ChEMBL_874192 (CHEMBL2187924)
Ki
1940±n/a nM
Citation
 Rempel, VVolz, NHinz, SKarcz, TMeliciani, INieger, MWenzel, WBräse, SMüller, CE 7-Alkyl-3-benzylcoumarins: a versatile scaffold for the development of potent and selective cannabinoid receptor agonists and antagonists. J Med Chem 55:7967-77 (2012)  
Target
Name:
Cannabinoid receptor 2
Synonyms:
CANNABINOID CB2 CB2 CB2B CNR2_HUMAN Cannabinoid CB2 receptor Cannabinoid receptor 2 (CB2R) | hCB2
Type:
G Protein-Coupled Receptor (GPCR)
Mol. Mass.:
39690.94
Organism:
Homo sapiens (Human)
Description:
P34972
Residue:
360
  
Inhibitor
Name:
BDBM50398226
Synonyms:
CHEMBL2177260
Type:
Small organic molecule
Emp. Form.:
C21H21ClO3
Mol. Mass.:
356.843
SMILES:
CCCCCc1cc(O)c2cc(Cc3ccccc3Cl)c(=O)oc2c1
: