Target
Protective antigen
Ligand
BDBM50398483
Substrate
Meas. Tech.
ChEMBL_872778 (CHEMBL2185603)
EC50
1000±n/a nM
Citation
 Wein, ANWilliams, BNLiu, SErmolinsky, BProvenzano, DAbagyan, ROrry, ALeppla, SHPeredelchuk, M Small molecule inhibitors of Bacillus anthracis protective antigen proteolytic activation and oligomerization. J Med Chem 55:7998-8006 (2012)  
Target
Name:
Protective antigen
Synonyms:
PAG_BACAN pagA
Type:
PROTEIN
Mol. Mass.:
85806.95
Organism:
Bacillus anthracis
Description:
ChEMBL_872965
Residue:
764
  
Inhibitor
Name:
BDBM50398483
Synonyms:
CHEMBL2179141
Type:
Small organic molecule
Emp. Form.:
C27H22N2O4
Mol. Mass.:
438.4746
SMILES:
Oc1ccccc1\C=N\c1ccc(Cc2ccc(\N=C\c3ccccc3O)c(O)c2)cc1O
: