Target
Neuronal acetylcholine receptor subunit alpha-7
Ligand
BDBM50397944
Substrate
Meas. Tech.
ChEMBL_873559 (CHEMBL2187476)
Ki
1.6±n/a nM
Citation
 Breining, SRMelvin, MBhatti, BSByrd, GDKiser, MNHepler, CDHooker, DNZhang, JReynolds, LABenson, LRFedorov, NBSidach, SSMitchener, JPLucero, LMLukas, RJWhiteaker, PYohannes, D Structure-activity studies of 7-heteroaryl-3-azabicyclo[3.3.1]non-6-enes: a novel class of highly potent nicotinic receptor ligands. J Med Chem 55:9929-45 (2012)  
Target
Name:
Neuronal acetylcholine receptor subunit alpha-7
Synonyms:
ACHA7_HUMAN Cholinergic, Nicotinic Alpha7 Neuronal acetylcholine receptor protein alpha-7 subunit Nicotinic acetylcholine receptor alpha-7 (alpha7 nAChR)
Type:
Mol. Mass.:
56448.33
Organism:
Homo sapiens (Human)
Description:
CHRNA7 (NACHRA7)
Residue:
502
  
Inhibitor
Name:
BDBM50397944
Synonyms:
CHEMBL2177512
Type:
Small organic molecule
Emp. Form.:
C12H17N3
Mol. Mass.:
203.2835
SMILES:
C1NCC2CC1CN(C2)c1cccnc1
: