Target
Neuronal acetylcholine receptor subunit alpha-4/beta-2
Ligand
BDBM50398821
Substrate
Meas. Tech.
ChEMBL_873551 (CHEMBL2187468)
EC50
35±n/a nM
Citation
 Breining, SRMelvin, MBhatti, BSByrd, GDKiser, MNHepler, CDHooker, DNZhang, JReynolds, LABenson, LRFedorov, NBSidach, SSMitchener, JPLucero, LMLukas, RJWhiteaker, PYohannes, D Structure-activity studies of 7-heteroaryl-3-azabicyclo[3.3.1]non-6-enes: a novel class of highly potent nicotinic receptor ligands. J Med Chem 55:9929-45 (2012)  
Target
Name:
Neuronal acetylcholine receptor subunit alpha-4/beta-2
Synonyms:
Neuronal acetylcholine receptor Alpha-4/Beta-2 Neuronal acetylcholine receptor; alpha4/beta2 | nAChR subtypes alpha4 beta2
Type:
Protein
Mol. Mass.:
Description:
Components:
This complex has 2 components.
Component 1
Name:
Neuronal acetylcholine receptor subunit alpha-4
Synonyms:
ACHA4_HUMAN CHRNA4 protein Neuronal acetylcholine receptor protein alpha-4 subunit Nicotinic acetylcholine receptor alpha4/beta2/alpha5
Type:
Mol. Mass.:
69963.49
Organism:
Homo sapiens (Human)
Description:
NACHRA4
Residue:
627
  
Component 2
Name:
Neuronal acetylcholine receptor subunit beta-2
Synonyms:
ACHB2_HUMAN Neuronal acetylcholine receptor protein beta-2 subunit | Nicotinic acetylcholine receptor alpha3/beta2/alpha5
Type:
Protein
Mol. Mass.:
57020.50
Organism:
Homo sapiens (Human)
Description:
P17787
Residue:
502
  
Inhibitor
Name:
BDBM50398821
Synonyms:
CHEMBL2177537
Type:
Small organic molecule
Emp. Form.:
C13H16N2
Mol. Mass.:
200.2795
SMILES:
C1NC[C@H]2C[C@@H]1CC(=C2)c1cccnc1
: